Reaction Details
TargetG-protein coupled receptor 84
LigandBDBM50245481
Substrate/Competitorn/a
Meas. Tech.ChEMBL_1674753 (CHEMBL4024896)
IC50 10.0±n/a nM
Citation Liu, YMNepali, KLiou, JP Idiopathic Pulmonary Fibrosis: Current Status, Recent Progress, and Emerging Targets. J Med Chem60:527-553 (2017) 
 
G-protein coupled receptor 84
Name:G-protein coupled receptor 84
Type:PROTEIN
Mol. Mass.:43726.73
Organism:Homo sapiens (Human)
Description:ChEMBL_116040
Residue:396
BDBM50245481
NameBDBM50245481
Synonyms:CHEMBL4060589
TypeSmall organic molecule
Emp. Form.C27H20N4O4
Mol. Mass.464.4721
SMILESO=c1cc(OCC2COc3ncccc3O2)cc2-c3ccc(cc3CCn12)C#Cc1ccncn1