Reaction Details
TargetG-protein coupled receptor 84
LigandBDBM50245482
Substrate/Competitorn/a
Meas. Tech.ChEMBL_1674753 (CHEMBL4024896)
IC50 10.0±n/a nM
Citation Liu, YMNepali, KLiou, JP Idiopathic Pulmonary Fibrosis: Current Status, Recent Progress, and Emerging Targets. J Med Chem60:527-553 (2017) 
 
G-protein coupled receptor 84
Name:G-protein coupled receptor 84
Type:PROTEIN
Mol. Mass.:43726.73
Organism:Homo sapiens (Human)
Description:ChEMBL_116040
Residue:396
BDBM50245482
NameBDBM50245482
Synonyms:CHEMBL4069275
TypeSmall organic molecule
Emp. Form.C27H26N4O5
Mol. Mass.486.5191
SMILESCc1cc(COc2ccc-3c(CCn4c-3cc(OCC3COc5ncccc5O3)cc4=O)c2)nn1C