Reaction Details
TargetDisintegrin and metalloproteinase domain-containing protein 17
LigandBDBM50245492
Substrate/Competitorn/a
Meas. Tech.ChEMBL_1674758 (CHEMBL4024901)
IC50 0.100000±n/a nM
Citation Liu, YMNepali, KLiou, JP Idiopathic Pulmonary Fibrosis: Current Status, Recent Progress, and Emerging Targets. J Med Chem60:527-553 (2017) 
 
Disintegrin and metalloproteinase domain-containing protein 17
Name:Disintegrin and metalloproteinase domain-containing protein 17
Type:Enzyme
Mol. Mass.:93007.89
Organism:Homo sapiens (Human)
Description:
Residue:824
BDBM50245492
NameBDBM50245492
Synonyms:CHEMBL4082554
TypeSmall organic molecule
Emp. Form.C25H25N3O5S
Mol. Mass.479.548
SMILES[H][C@@]12C[C@@]([H])(C=C1)[C@@H]([C@@H]2NS(=O)(=O)c1ccc(OCc2cc(C)nc3ccccc23)cc1)C(=O)NO