Reaction Details
TargetProtein-arginine deiminase type-4
LigandBDBM50246173
Substrate/Competitorn/a
Meas. Tech.ChEMBL_1676557 (CHEMBL4026700)
Ki>10000000±n/a nM
Citation Tejeda, EJCBello, AMWasilewski, EKoebel, ADunn, SKotra, LP Noncovalent Protein Arginine Deiminase (PAD) Inhibitors Are Efficacious in Animal Models of Multiple Sclerosis. J Med Chem60:8876-8887 (2017) 
 
Protein-arginine deiminase type-4
Name:Protein-arginine deiminase type-4
Type:Enzyme Catalytic Domain
Mol. Mass.:74078.90
Organism:Homo sapiens (Human)
Description:gi_216548487
Residue:663
BDBM50246173
NameBDBM50246173
Synonyms:CHEMBL4082498
TypeSmall organic molecule
Emp. Form.C19H36N4O2
Mol. Mass.352.5147
SMILESCC(C)NC(=O)[C@H](CCN1CCN(C)CC1)NC(=O)C1CCCCC1