Reaction Details
TargetProtein-arginine deiminase type-2
LigandBDBM454163
Substrate/Competitorn/a
Meas. Tech.ChEMBL_1676559 (CHEMBL4026702)
Ki>10000000±n/a nM
Citation Tejeda, EJCBello, AMWasilewski, EKoebel, ADunn, SKotra, LP Noncovalent Protein Arginine Deiminase (PAD) Inhibitors Are Efficacious in Animal Models of Multiple Sclerosis. J Med Chem60:8876-8887 (2017) 
 
Protein-arginine deiminase type-2
Name:Protein-arginine deiminase type-2
Type:PROTEIN
Mol. Mass.:76237.59
Organism:Mus musculus
Description:ChEMBL_105600
Residue:673
BDBM454163
NameBDBM454163
Synonyms:BDBM50246172 | US10716791, Code KP-287
TypeSmall organic molecule
Emp. Form.C17H33N5O3
Mol. Mass.355.4756
SMILESCC(C)NC(=O)[C@H](CCN1CCN(C)CC1)NC(=O)N1CCOCC1