Reaction Details
TargetProtein-arginine deiminase type-4
LigandBDBM454165
Substrate/Competitorn/a
Meas. Tech.ChEMBL_1676557 (CHEMBL4026700)
Ki 488000±n/a nM
Citation Tejeda, EJCBello, AMWasilewski, EKoebel, ADunn, SKotra, LP Noncovalent Protein Arginine Deiminase (PAD) Inhibitors Are Efficacious in Animal Models of Multiple Sclerosis. J Med Chem60:8876-8887 (2017) 
 
Protein-arginine deiminase type-4
Name:Protein-arginine deiminase type-4
Type:Enzyme Catalytic Domain
Mol. Mass.:74078.90
Organism:Homo sapiens (Human)
Description:gi_216548487
Residue:663
BDBM454165
NameBDBM454165
Synonyms:BDBM50246195 | US10716791, Code KP-289
TypeSmall organic molecule
Emp. Form.C17H28N4O3
Mol. Mass.336.4292
SMILESCC(C)NC(=O)[C@H](CCN1CCN(C)CC1)NC(=O)c1ccco1