Reaction Details
TargetProtein-arginine deiminase type-2
LigandBDBM50246191
Substrate/Competitorn/a
Meas. Tech.ChEMBL_1676559 (CHEMBL4026702)
Ki 71000±n/a nM
Citation Tejeda, EJCBello, AMWasilewski, EKoebel, ADunn, SKotra, LP Noncovalent Protein Arginine Deiminase (PAD) Inhibitors Are Efficacious in Animal Models of Multiple Sclerosis. J Med Chem60:8876-8887 (2017) 
 
Protein-arginine deiminase type-2
Name:Protein-arginine deiminase type-2
Type:PROTEIN
Mol. Mass.:76237.59
Organism:Mus musculus
Description:ChEMBL_105600
Residue:673
BDBM50246191
NameBDBM50246191
Synonyms:CHEMBL4089260
TypeSmall organic molecule
Emp. Form.C19H22N6O2
Mol. Mass.366.417
SMILESCn1cccc1C(=O)N[C@@H](CCn1ccnn1)C(=O)NCc1ccccc1