Reaction Details
TargetCholecystokinin receptor type A
LigandBDBM50004434
Substrate/Competitorn/a
Meas. Tech.ChEBML_49569
EC50 60±n/a nM
Citation Ron, DGilon, CHanani, MVromen, ASelinger, ZChorev, M N-methylated analogs of Ac[Nle28,31]CCK(26-33): synthesis, activity, and receptor selectivity. J Med Chem35:2806-11 (1992) Cholecystokinin receptor type A
Name:Cholecystokinin receptor type A
Type:n/a
Mol. Mass.:48229.77
Organism:Cavia porcellus
Description:n/a
Residue:430
BDBM50004434
NameBDBM50004434
Synonyms:3-Acetylamino-N-[1-(1-{2-[1-{1-[1-(1-carbamoyl-2-phenyl-ethylcarbamoyl)-2-carboxy-ethylcarbamoyl]-pentylcarbamoyl}-2-(1H-indol-3-yl)-ethylcarbamoyl]-pyrrolidine-1-carbonyl}-pentylcarbamoyl)-2-(4-sulfooxy-phenyl)-ethyl]-succinamic acid | CHEMBL2370248
TypeSmall organic molecule
Emp. Form.C56H72N10O17S
Mol. Mass.1189.293
SMILESCCCC[C@H](NC(=O)[C@H](Cc1c[nH]c2ccccc12)NC(=O)[C@@H]1CCCN1C(=O)[C@H](CCCC)NC(=O)[C@H](Cc1ccc(OS(O)(=O)=O)cc1)NC(=O)[C@H](CC(O)=O)NC(C)=O)C(=O)N[C@@H](CC(O)=O)C(=O)N[C@@H](Cc1ccccc1)C(N)=O