Reaction Details
TargetNeuronal acetylcholine receptor subunit alpha-3/alpha-5/beta-4
LigandBDBM50246823
Substrate/Competitorn/a
Meas. Tech.ChEMBL_1676970 (CHEMBL4027113)
Ki 957±n/a nM
Citation Wu, JCippitelli, AZhang, YDebevec, GSchoch, JOzawa, AYu, YLiu, HChen, WHoughten, RAWelmaker, GSGiulianotti, MAToll, L Highly Selective and Potent?4?2 nAChR Antagonist Inhibits Nicotine Self-Administration and Reinstatement in Rats. J Med Chem60:10092-10104 (2017) 
 
Neuronal acetylcholine receptor subunit alpha-3/alpha-5/beta-4
Name:Neuronal acetylcholine receptor subunit alpha-3/alpha-5/beta-4
Synonyms:NIcotinic acetylcholine receptor alpha-3/beta-4/alpha-5
Type:n/a
Mol. Mass.:n/a
Description:ASSAY_ID of ChEMBL is 1676970
Components:This complex has 3 components.
Component 1
Name:Neuronal acetylcholine receptor subunit alpha-3
Type:Enzyme
Mol. Mass.:56995.52
Organism:Rattus norvegicus (Rat)
Description:P04757
Residue:499
Component 2
Name:Neuronal acetylcholine receptor subunit beta-4
Synonyms:ACHB4_RAT Chrnb4 Neuronal acetylcholine receptor non-alpha-2 chain | Neuronal acetylcholine receptor protein beta-4 subunit
Type:Enzyme
Mol. Mass.:55863.89
Organism:Rattus norvegicus (Rat)
Description:P12392
Residue:495
Component 3
Name:Neuronal acetylcholine receptor subunit alpha-5
Synonyms:ACHA5_RAT Cholinergic, Nicotinic Alpha6Beta3Beta4Alpha5 | Chrna5
Type:Enzyme Catalytic Domain
Mol. Mass.:51875.01
Organism:RAT
Description:Cholinergic, Nicotinic Alpha6Beta3Beta4Alpha5 0 RAT::P20420
Residue:452
BDBM50246823
NameBDBM50246823
Synonyms:CHEMBL4071277
TypeSmall organic molecule
Emp. Form.C11H16N4O
Mol. Mass.220.2709
SMILESOC[C@H]1CNC(=N)N1CCc1cccnc1