Reaction Details
TargetRibonucleoside-diphosphate reductase large subunit
LigandBDBM50247408
Substrate/Competitorn/a
Meas. Tech.ChEMBL_1677698 (CHEMBL4027841)
Kd 37000±n/a nM
Citation Huff, SEMohammed, FAYang, MAgrawal, PPink, JHarris, MEDealwis, CGViswanathan, R Structure-Guided Synthesis and Mechanistic Studies Reveal Sweetspots on Naphthyl Salicyl Hydrazone Scaffold as Non-Nucleosidic Competitive, Reversible Inhibitors of Human Ribonucleotide Reductase. J Med Chem61:666-680 (2018) 
 
Ribonucleoside-diphosphate reductase large subunit
Name:Ribonucleoside-diphosphate reductase large subunit
Type:PROTEIN
Mol. Mass.:90074.67
Organism:Homo sapiens (Human)
Description:ChEMBL_90946
Residue:792
BDBM50247408
NameBDBM50247408
Synonyms:CHEMBL4067105
TypeSmall organic molecule
Emp. Form.C18H14N2O3
Mol. Mass.306.3154
SMILESOc1ccccc1C(=O)N\N=C\c1c(O)ccc2ccccc12