Reaction Details
TargetRibonucleoside-diphosphate reductase large subunit
LigandBDBM50247410
Substrate/Competitorn/a
Meas. Tech.ChEMBL_1677693 (CHEMBL4027836)
IC50 70100±n/a nM
Citation Huff, SEMohammed, FAYang, MAgrawal, PPink, JHarris, MEDealwis, CGViswanathan, R Structure-Guided Synthesis and Mechanistic Studies Reveal Sweetspots on Naphthyl Salicyl Hydrazone Scaffold as Non-Nucleosidic Competitive, Reversible Inhibitors of Human Ribonucleotide Reductase. J Med Chem61:666-680 (2018) 
 
Ribonucleoside-diphosphate reductase large subunit
Name:Ribonucleoside-diphosphate reductase large subunit
Type:PROTEIN
Mol. Mass.:90074.67
Organism:Homo sapiens (Human)
Description:ChEMBL_90946
Residue:792
BDBM50247410
NameBDBM50247410
Synonyms:CHEMBL4077097
TypeSmall organic molecule
Emp. Form.C17H13N3O3
Mol. Mass.307.3034
SMILESOc1ccc2ccccc2c1\C=N\Nc1ccc(cc1)[N+]([O-])=O