Reaction Details
TargetRibonucleoside-diphosphate reductase large subunit
LigandBDBM50247412
Substrate/Competitorn/a
Meas. Tech.ChEMBL_1677693 (CHEMBL4027836)
IC50 95200±n/a nM
Citation Huff, SEMohammed, FAYang, MAgrawal, PPink, JHarris, MEDealwis, CGViswanathan, R Structure-Guided Synthesis and Mechanistic Studies Reveal Sweetspots on Naphthyl Salicyl Hydrazone Scaffold as Non-Nucleosidic Competitive, Reversible Inhibitors of Human Ribonucleotide Reductase. J Med Chem61:666-680 (2018) 
 
Ribonucleoside-diphosphate reductase large subunit
Name:Ribonucleoside-diphosphate reductase large subunit
Type:PROTEIN
Mol. Mass.:90074.67
Organism:Homo sapiens (Human)
Description:ChEMBL_90946
Residue:792
BDBM50247412
NameBDBM50247412
Synonyms:CHEMBL4074537
TypeSmall organic molecule
Emp. Form.C20H19N3O
Mol. Mass.317.3844
SMILESCN(C)c1ccc(\C=N\N=C\c2c(O)ccc3ccccc23)cc1