Reaction Details
TargetRibonucleoside-diphosphate reductase large subunit
LigandBDBM50247439
Substrate/Competitorn/a
Meas. Tech.ChEMBL_1677693 (CHEMBL4027836)
IC50 39420±n/a nM
Citation Huff, SEMohammed, FAYang, MAgrawal, PPink, JHarris, MEDealwis, CGViswanathan, R Structure-Guided Synthesis and Mechanistic Studies Reveal Sweetspots on Naphthyl Salicyl Hydrazone Scaffold as Non-Nucleosidic Competitive, Reversible Inhibitors of Human Ribonucleotide Reductase. J Med Chem61:666-680 (2018) 
 
Ribonucleoside-diphosphate reductase large subunit
Name:Ribonucleoside-diphosphate reductase large subunit
Type:PROTEIN
Mol. Mass.:90074.67
Organism:Homo sapiens (Human)
Description:ChEMBL_90946
Residue:792
BDBM50247439
NameBDBM50247439
Synonyms:CHEMBL4075660
TypeSmall organic molecule
Emp. Form.C18H14N2O
Mol. Mass.274.3166
SMILESOc1ccc2ccccc2c1\C=N\N=C\c1ccccc1