Reaction Details
TargetRibonucleoside-diphosphate reductase subunit M2
LigandBDBM50198892
Substrate/Competitorn/a
Meas. Tech.ChEMBL_1677703 (CHEMBL4027846)
IC50 185±n/a nM
Citation Huff, SEMohammed, FAYang, MAgrawal, PPink, JHarris, MEDealwis, CGViswanathan, R Structure-Guided Synthesis and Mechanistic Studies Reveal Sweetspots on Naphthyl Salicyl Hydrazone Scaffold as Non-Nucleosidic Competitive, Reversible Inhibitors of Human Ribonucleotide Reductase. J Med Chem61:666-680 (2018) 
 
Ribonucleoside-diphosphate reductase subunit M2
Name:Ribonucleoside-diphosphate reductase subunit M2
Type:PROTEIN
Mol. Mass.:44868.59
Organism:Homo sapiens (Human)
Description:ChEMBL_195255
Residue:389
BDBM50198892
NameBDBM50198892
Synonyms:3-AP Triapine | US10155732, Compound 3-AP
TypeSmall organic molecule
Emp. Form.C7H9N5S
Mol. Mass.195.245
SMILESNC(=S)N\N=C\c1ncccc1N