Reaction Details
TargetcGMP-dependent 3',5'-cyclic phosphodiesterase
LigandBDBM107767
Substrate/Competitorn/a
Meas. Tech.ChEMBL_1677919 (CHEMBL4028062)
Ki 4.2±n/a nM
Citation Helal, CJArnold, EBoyden, TChang, CChappie, TAFisher, EHajos, MHarms, JFHoffman, WEHumphrey, JMPandit, JKang, ZKleiman, RJKormos, BLLee, CWLu, JMaklad, NMcDowell, LMcGinnis, DO'Connor, REO'Donnell, CJOgden, APiotrowski, MSchmidt, CJSeymour, PAUeno, HVansell, NVerhoest, PRYang, EX Identification of a Potent, Highly Selective, and Brain Penetrant Phosphodiesterase 2A Inhibitor Clinical Candidate. J Med Chem61:1001-1018 (2018) 
 
cGMP-dependent 3',5'-cyclic phosphodiesterase
Name:cGMP-dependent 3',5'-cyclic phosphodiesterase
Type:PROTEIN
Mol. Mass.:104640.72
Organism:Rattus norvegicus
Description:ChEMBL_156330
Residue:928
BDBM107767
NameBDBM107767
Synonyms:US11419874, PF-05180999 | US8598155, 2
TypeSmall organic molecule
Emp. Form.C19H17F3N8
Mol. Mass.414.3871
SMILESCc1nc(-c2cnn(C)c2-c2ccc(cn2)C(F)(F)F)c2c(ncnn12)N1CCC1