Reaction Details
TargetHistone deacetylase 6
LigandBDBM50247557
Substrate/Competitorn/a
Meas. Tech.ChEMBL_1678047 (CHEMBL4028190)
IC50 20±n/a nM
Citation Lee, HYNepali, KHuang, FIChang, CYLai, MJLi, YHHuang, HLYang, CRLiou, JP (N-Hydroxycarbonylbenylamino)quinolines as Selective Histone Deacetylase 6 Inhibitors Suppress Growth of Multiple Myeloma in Vitro and in Vivo. J Med Chem61:905-917 (2018) 
 
Histone deacetylase 6
Name:Histone deacetylase 6
Type:Chromatin regulator; hydrolase; repressor
Mol. Mass.:131381.51
Organism:Homo sapiens (Human)
Description:Q9UBN7
Residue:1215
BDBM50247557
NameBDBM50247557
Synonyms:CHEMBL4082487
TypeSmall organic molecule
Emp. Form.C17H18N2O2
Mol. Mass.282.337
SMILESONC(=O)c1ccc(CNc2cccc3CCCc23)cc1