Reaction Details
TargetCarbonic anhydrase 1
LigandBDBM50028972
Substrate/Competitorn/a
Meas. Tech.ChEBML_1679198
Ki>100000±n/a nM
Citation Angeli, ATanini, DViglianisi, CPanzella, LCapperucci, AMenichetti, SSupuran, CT Evaluation of selenide, diselenide and selenoheterocycle derivatives as carbonic anhydrase I, II, IV, VII and IX inhibitors. Bioorg Med Chem25:2518-2523 (2017) 
 
Carbonic anhydrase 1
Name:Carbonic anhydrase 1
Type:Enzyme
Mol. Mass.:28873.37
Organism:Homo sapiens (Human)
Description:P00915
Residue:261
BDBM50028972
NameBDBM50028972
Synonyms:Benzene Selenoic Acid
TypeSmall organic molecule
Emp. Form.C6H6O2Se
Mol. Mass.189.07
SMILESO[Se](=O)c1ccccc1