Reaction Details
TargetCarbonic anhydrase 7
LigandBDBM50028972
Substrate/Competitorn/a
Meas. Tech.ChEBML_1679201
Ki>100000±n/a nM
Citation Angeli, ATanini, DViglianisi, CPanzella, LCapperucci, AMenichetti, SSupuran, CT Evaluation of selenide, diselenide and selenoheterocycle derivatives as carbonic anhydrase I, II, IV, VII and IX inhibitors. Bioorg Med Chem25:2518-2523 (2017) 
 
Carbonic anhydrase 7
Name:Carbonic anhydrase 7
Type:Enzyme
Mol. Mass.:29664.11
Organism:Homo sapiens (Human)
Description:Human cloned isozyme.
Residue:264
BDBM50028972
NameBDBM50028972
Synonyms:Benzene Selenoic Acid
TypeSmall organic molecule
Emp. Form.C6H6O2Se
Mol. Mass.189.07
SMILESO[Se](=O)c1ccccc1