Reaction Details
TargetCarbonic anhydrase 4
LigandBDBM50028972
Substrate/Competitorn/a
Meas. Tech.ChEBML_1679200
Ki>100000±n/a nM
Citation Angeli, ATanini, DViglianisi, CPanzella, LCapperucci, AMenichetti, SSupuran, CT Evaluation of selenide, diselenide and selenoheterocycle derivatives as carbonic anhydrase I, II, IV, VII and IX inhibitors. Bioorg Med Chem25:2518-2523 (2017) 
 
Carbonic anhydrase 4
Name:Carbonic anhydrase 4
Type:Enzyme
Mol. Mass.:35037.98
Organism:Homo sapiens (Human)
Description:P22748
Residue:312
BDBM50028972
NameBDBM50028972
Synonyms:Benzene Selenoic Acid
TypeSmall organic molecule
Emp. Form.C6H6O2Se
Mol. Mass.189.07
SMILESO[Se](=O)c1ccccc1