Reaction Details
TargetPoly [ADP-ribose] polymerase 1
LigandBDBM27135
Substrate/Competitorn/a
Meas. Tech.ChEMBL_1679341 (CHEMBL4029618)
IC50 132±n/a nM
Citation Zhou, JJi, MZhu, ZCao, RChen, XXu, B Discovery of 2-substituted 1H-benzo[d]immidazole-4-carboxamide derivatives as novel poly(ADP-ribose)polymerase-1 inhibitors with in vivo anti-tumor activity. Eur J Med Chem132:26-41 (2017) 
 
Poly [ADP-ribose] polymerase 1
Name:Poly [ADP-ribose] polymerase 1
Type:n/a
Mol. Mass.:113114.22
Organism:Homo sapiens (Human)
Description:P09874
Residue:1014
BDBM27135
NameBDBM27135
Synonyms:2-[(2R)-2-methylpyrrolidin-2-yl]-1H-1,3-benzodiazole-4-carboxamide benzimidazole carboxamide, 3a
TypeSmall organic molecule
Emp. Form.C13H16N4O
Mol. Mass.244.2923
SMILESC[C@@]1(CCCN1)c1nc2cccc(C(N)=O)c2[nH]1