Reaction Details
TargetProtein-arginine deiminase type-1
LigandBDBM50248824
Substrate/Competitorn/a
Meas. Tech.ChEMBL_1679372 (CHEMBL4029649)
Ki 602000±n/a nM
Citation Sarswat, AWasilewski, EChakka, SKBello, AMCaprariello, AVMuthuramu, CMStys, PKDunn, SEKotra, LP Inhibitors of protein arginine deiminases and their efficacy in animal models of multiple sclerosis. Bioorg Med Chem25:2643-2656 (2017) 
 
Protein-arginine deiminase type-1
Name:Protein-arginine deiminase type-1
Type:PROTEIN
Mol. Mass.:74664.17
Organism:Homo sapiens (Human)
Description:ChEMBL_1290380
Residue:663
BDBM50248824
NameBDBM50248824
Synonyms:CHEMBL4059499
TypeSmall organic molecule
Emp. Form.C11H19N3O3
Mol. Mass.241.2869
SMILESCC1(C)NC(=O)N(CCN2CCOCC2)C1=O