Reaction Details
TargetProtein-arginine deiminase type-4
LigandBDBM50248830
Substrate/Competitorn/a
Meas. Tech.ChEMBL_1679371 (CHEMBL4029648)
Ki 632000±n/a nM
Citation Sarswat, AWasilewski, EChakka, SKBello, AMCaprariello, AVMuthuramu, CMStys, PKDunn, SEKotra, LP Inhibitors of protein arginine deiminases and their efficacy in animal models of multiple sclerosis. Bioorg Med Chem25:2643-2656 (2017) 
 
Protein-arginine deiminase type-4
Name:Protein-arginine deiminase type-4
Type:Enzyme Catalytic Domain
Mol. Mass.:74078.90
Organism:Homo sapiens (Human)
Description:gi_216548487
Residue:663
BDBM50248830
NameBDBM50248830
Synonyms:CHEMBL4089583
TypeSmall organic molecule
Emp. Form.C10H14N4O2
Mol. Mass.222.2438
SMILESCC1(C)NC(=O)N(CCn2ccnc2)C1=O