Reaction Details
TargetProtein-arginine deiminase type-1
LigandBDBM50426302
Substrate/Competitorn/a
Meas. Tech.ChEMBL_1679372 (CHEMBL4029649)
Ki 445000±n/a nM
Citation Sarswat, AWasilewski, EChakka, SKBello, AMCaprariello, AVMuthuramu, CMStys, PKDunn, SEKotra, LP Inhibitors of protein arginine deiminases and their efficacy in animal models of multiple sclerosis. Bioorg Med Chem25:2643-2656 (2017) 
 
Protein-arginine deiminase type-1
Name:Protein-arginine deiminase type-1
Type:PROTEIN
Mol. Mass.:74664.17
Organism:Homo sapiens (Human)
Description:ChEMBL_1290380
Residue:663
BDBM50426302
NameBDBM50426302
Synonyms:CHEMBL2312698
TypeSmall organic molecule
Emp. Form.C10H18N4O2
Mol. Mass.226.2755
SMILESCC1(C)NC(=O)N(CN2CCNCC2)C1=O