Reaction Details
TargetProtein-arginine deiminase type-4
LigandBDBM50248831
Substrate/Competitorn/a
Meas. Tech.ChEMBL_1679371 (CHEMBL4029648)
Ki 4643000±n/a nM
Citation Sarswat, AWasilewski, EChakka, SKBello, AMCaprariello, AVMuthuramu, CMStys, PKDunn, SEKotra, LP Inhibitors of protein arginine deiminases and their efficacy in animal models of multiple sclerosis. Bioorg Med Chem25:2643-2656 (2017) 
 
Protein-arginine deiminase type-4
Name:Protein-arginine deiminase type-4
Type:Enzyme Catalytic Domain
Mol. Mass.:74078.90
Organism:Homo sapiens (Human)
Description:gi_216548487
Residue:663
BDBM50248831
NameBDBM50248831
Synonyms:CHEMBL4102346
TypeSmall organic molecule
Emp. Form.C11H19N3O2
Mol. Mass.225.2875
SMILESCC1(C)NC(=O)N(CCN2CCCC2)C1=O