Reaction Details
TargetMitogen-activated protein kinase 1
LigandBDBM50248937
Substrate/Competitorn/a
Meas. Tech.ChEMBL_1679547 (CHEMBL4029824)
Ki 3000±n/a nM
Citation Edupuganti, RTaliaferro, JMWang, QXie, XCho, EJVidhu, FRen, PAnslyn, EVBartholomeusz, CDalby, KN Discovery of a potent inhibitor of MELK that inhibits expression of the anti-apoptotic protein Mcl-1 and TNBC cell growth. Bioorg Med Chem25:2609-2616 (2017) 
 
Mitogen-activated protein kinase 1
Name:Mitogen-activated protein kinase 1
Type:Ser/Thr Protein Kinase
Mol. Mass.:41392.76
Organism:Homo sapiens (Human)
Description:P28482
Residue:360
BDBM50248937
NameBDBM50248937
Synonyms:CHEMBL4062168 | US10981896, Compound 15
TypeSmall organic molecule
Emp. Form.C31H33N5O4
Mol. Mass.539.6248
SMILESCOC(=O)c1ccc2NC(=O)\C(=C(/Nc3ccc(cc3)N(C)C(=O)CN3CCN(C)CC3)c3ccccc3)c2c1