Reaction Details
TargetMaternal embryonic leucine zipper kinase
LigandBDBM50248938
Substrate/Competitorn/a
Meas. Tech.ChEMBL_1679543 (CHEMBL4029820)
Ki 0.680000±n/a nM
Citation Edupuganti, RTaliaferro, JMWang, QXie, XCho, EJVidhu, FRen, PAnslyn, EVBartholomeusz, CDalby, KN Discovery of a potent inhibitor of MELK that inhibits expression of the anti-apoptotic protein Mcl-1 and TNBC cell growth. Bioorg Med Chem25:2609-2616 (2017) 
 
Maternal embryonic leucine zipper kinase
Name:Maternal embryonic leucine zipper kinase
Type:Enzyme
Mol. Mass.:74665.45
Organism:Homo sapiens (Human)
Description:Q14680
Residue:651
BDBM50248938
NameBDBM50248938
Synonyms:CHEMBL4089284 | US10981896, Compound 21
TypeSmall organic molecule
Emp. Form.C30H31N5O4
Mol. Mass.525.5982
SMILESCN(C(=O)CN1CCN(C)CC1)c1ccc(N\C(=C2/C(=O)Nc3ccc(cc23)C(O)=O)c2ccccc2)cc1