Reaction Details
TargetThymidylate synthase
LigandBDBM50005335
Substrate/Competitorn/a
Meas. Tech.ChEBML_209652
Ki 11±n/a nM
Citation Reich, SHFuhry, MANguyen, DPino, MJWelsh, KMWebber, SJanson, CAJordan, SRMatthews, DASmith, WW Design and synthesis of novel 6,7-imidazotetrahydroquinoline inhibitors of thymidylate synthase using iterative protein crystal structure analysis. J Med Chem35:847-58 (1992) Thymidylate synthase
Name:Thymidylate synthase
Type:Enzyme
Mol. Mass.:35718.07
Organism:Homo sapiens (Human)
Description:n/a
Residue:313
BDBM50005335
NameBDBM50005335
Synonyms:2-[4-(2-Amino-1,6,7,8-tetrahydro-imidazo[4,5-g]quinolin-5-ylmethyl)-benzoylamino]-pentanedioic acid | CHEMBL169411
TypeSmall organic molecule
Emp. Form.C23H25N5O5
Mol. Mass.451.4751
SMILESNc1nc2cc3CCCN(Cc4ccc(cc4)C(=O)NC(CCC(O)=O)C(O)=O)c3cc2[nH]1