Reaction Details
TargetMuscarinic acetylcholine receptor M1
LigandBDBM50005364
Substrate/Competitorn/a
Meas. Tech.ChEMBL_138683 (CHEMBL748215)
EC50 110±n/a nM
Citation Showell, GABaker, RDavis, JHargreaves, RFreedman, SBHoogsteen, KPatel, SSnow, RJ Synthesis and in vitro biological profile of all four isomers of the potent muscarinic agonist 3-(3-methyl-1,2,4-oxadiazol-5-yl)-1-azabicyclo[2.2.1]heptane. J Med Chem35:911-6 (1992) Muscarinic acetylcholine receptor M1
Name:Muscarinic acetylcholine receptor M1
Type:Enzyme Catalytic Domain
Mol. Mass.:51390.46
Organism:RAT
Description:P08482
Residue:460
BDBM50005364
NameBDBM50005364
Synonyms:(3S,4R)3-Methyl-3-(3-methyl-[1,2,4]oxadiazol-5-yl)-1-aza-bicyclo[2.2.1]heptane | CHEMBL171721
TypeSmall organic molecule
Emp. Form.C10H15N3O
Mol. Mass.193.2456
SMILESCc1noc(n1)C1(C)CN2CCC1C2