Reaction Details
TargetMuscarinic acetylcholine receptor M2
LigandBDBM50005363
Substrate/Competitorn/a
Meas. Tech.ChEMBL_139982 (CHEMBL751168)
EC50 3.30±n/a nM
Citation Showell, GABaker, RDavis, JHargreaves, RFreedman, SBHoogsteen, KPatel, SSnow, RJ Synthesis and in vitro biological profile of all four isomers of the potent muscarinic agonist 3-(3-methyl-1,2,4-oxadiazol-5-yl)-1-azabicyclo[2.2.1]heptane. J Med Chem35:911-6 (1992) Muscarinic acetylcholine receptor M2
Name:Muscarinic acetylcholine receptor M2
Type:GPCR
Mol. Mass.:51730.61
Organism:Homo sapiens (Human)
Description:P08172
Residue:466
BDBM50005363
NameBDBM50005363
Synonyms:(3R,4R)3-(3-Methyl-[1,2,4]oxadiazol-5-yl)-1-aza-bicyclo[2.2.1]heptane (3S,4S)3-(3-Methyl-[1,2,4]oxadiazol-5-yl)-1-aza-bicyclo[2.2.1]heptane CHEMBL92421
TypeSmall organic molecule
Emp. Form.C9H13N3O
Mol. Mass.179.219
SMILESCc1noc(n1)C1CN2CCC1C2