Reaction Details
TargetCalmodulin-domain protein kinase 1
LigandBDBM50249997
Substrate/Competitorn/a
Meas. Tech.ChEBML_1680859
IC50 8.9±n/a nM
Citation Rutaganira, FUBarks, JDhason, MSWang, QLopez, MSLong, SRadke, JBJones, NGMaddirala, ARJanetka, JWEl Bakkouri, MHui, RShokat, KMSibley, LD Inhibition of Calcium Dependent Protein Kinase 1 (CDPK1) by Pyrazolopyrimidine Analogs Decreases Establishment and Reoccurrence of Central Nervous System Disease by Toxoplasma gondii. J Med Chem60:9976-9989 (2017) 
 
Calmodulin-domain protein kinase 1
Name:Calmodulin-domain protein kinase 1
Type:Enzyme Catalytic Domain
Mol. Mass.:57248.42
Organism:Toxoplasma gondii
Description:n/a
Residue:507
BDBM50249997
NameBDBM50249997
Synonyms:CHEMBL4078124 | US11208411, Compound GXJ230
TypeSmall organic molecule
Emp. Form.C16H19N5O2
Mol. Mass.313.3544
SMILESCOc1cccc(Oc2nn(c3ncnc(N)c23)C(C)(C)C)c1