Reaction Details
TargetCalmodulin-domain protein kinase 1
LigandBDBM50250008
Substrate/Competitorn/a
Meas. Tech.ChEBML_1680859
IC50 219±n/a nM
Citation Rutaganira, FUBarks, JDhason, MSWang, QLopez, MSLong, SRadke, JBJones, NGMaddirala, ARJanetka, JWEl Bakkouri, MHui, RShokat, KMSibley, LD Inhibition of Calcium Dependent Protein Kinase 1 (CDPK1) by Pyrazolopyrimidine Analogs Decreases Establishment and Reoccurrence of Central Nervous System Disease by Toxoplasma gondii. J Med Chem60:9976-9989 (2017) 
 
Calmodulin-domain protein kinase 1
Name:Calmodulin-domain protein kinase 1
Type:Enzyme Catalytic Domain
Mol. Mass.:57248.42
Organism:Toxoplasma gondii
Description:n/a
Residue:507
BDBM50250008
NameBDBM50250008
Synonyms:CHEMBL4068845 | US11208411, Compound FUR7-89
TypeSmall organic molecule
Emp. Form.C17H18ClN5O2
Mol. Mass.359.81
SMILESNc1ncnc2n(CC3CCOCC3)nc(Oc3cccc(Cl)c3)c12