Reaction Details
TargetCalmodulin-domain protein kinase 1
LigandBDBM50250010
Substrate/Competitorn/a
Meas. Tech.ChEBML_1680859
IC50 517±n/a nM
Citation Rutaganira, FUBarks, JDhason, MSWang, QLopez, MSLong, SRadke, JBJones, NGMaddirala, ARJanetka, JWEl Bakkouri, MHui, RShokat, KMSibley, LD Inhibition of Calcium Dependent Protein Kinase 1 (CDPK1) by Pyrazolopyrimidine Analogs Decreases Establishment and Reoccurrence of Central Nervous System Disease by Toxoplasma gondii. J Med Chem60:9976-9989 (2017) 
 
Calmodulin-domain protein kinase 1
Name:Calmodulin-domain protein kinase 1
Type:Enzyme Catalytic Domain
Mol. Mass.:57248.42
Organism:Toxoplasma gondii
Description:n/a
Residue:507
BDBM50250010
NameBDBM50250010
Synonyms:CHEMBL4069866 | US11208411, Compound FUR7-77
TypeSmall organic molecule
Emp. Form.C18H22N6S
Mol. Mass.354.472
SMILESCc1cccc(Sc2nn(CC3CCNCC3)c3ncnc(N)c23)c1