Reaction Details
TargetCalmodulin-domain protein kinase 1
LigandBDBM50250012
Substrate/Competitorn/a
Meas. Tech.ChEBML_1680859
IC50 173±n/a nM
Citation Rutaganira, FUBarks, JDhason, MSWang, QLopez, MSLong, SRadke, JBJones, NGMaddirala, ARJanetka, JWEl Bakkouri, MHui, RShokat, KMSibley, LD Inhibition of Calcium Dependent Protein Kinase 1 (CDPK1) by Pyrazolopyrimidine Analogs Decreases Establishment and Reoccurrence of Central Nervous System Disease by Toxoplasma gondii. J Med Chem60:9976-9989 (2017) 
 
Calmodulin-domain protein kinase 1
Name:Calmodulin-domain protein kinase 1
Type:Enzyme Catalytic Domain
Mol. Mass.:57248.42
Organism:Toxoplasma gondii
Description:n/a
Residue:507
BDBM50250012
NameBDBM50250012
Synonyms:CHEMBL4080552 | US11208411, Compound MLC468
TypeSmall organic molecule
Emp. Form.C18H20F2N6
Mol. Mass.358.3884
SMILESNc1ncnc2n(CC3CCNCC3)nc(Cc3cc(F)cc(F)c3)c12