Reaction Details
TargetProto-oncogene tyrosine-protein kinase Src
LigandBDBM50250008
Substrate/Competitorn/a
Meas. Tech.ChEBML_1680860
IC50>10000±n/a nM
Citation Rutaganira, FUBarks, JDhason, MSWang, QLopez, MSLong, SRadke, JBJones, NGMaddirala, ARJanetka, JWEl Bakkouri, MHui, RShokat, KMSibley, LD Inhibition of Calcium Dependent Protein Kinase 1 (CDPK1) by Pyrazolopyrimidine Analogs Decreases Establishment and Reoccurrence of Central Nervous System Disease by Toxoplasma gondii. J Med Chem60:9976-9989 (2017) 
 
Proto-oncogene tyrosine-protein kinase Src
Name:Proto-oncogene tyrosine-protein kinase Src
Type:Protein
Mol. Mass.:59838.60
Organism:Homo sapiens (Human)
Description:P12931
Residue:536
BDBM50250008
NameBDBM50250008
Synonyms:CHEMBL4068845 | US11208411, Compound FUR7-89
TypeSmall organic molecule
Emp. Form.C17H18ClN5O2
Mol. Mass.359.81
SMILESNc1ncnc2n(CC3CCOCC3)nc(Oc3cccc(Cl)c3)c12