Reaction Details
TargetProto-oncogene tyrosine-protein kinase Src
LigandBDBM50250017
Substrate/Competitorn/a
Meas. Tech.ChEBML_1680860
IC50>10000±n/a nM
Citation Rutaganira, FUBarks, JDhason, MSWang, QLopez, MSLong, SRadke, JBJones, NGMaddirala, ARJanetka, JWEl Bakkouri, MHui, RShokat, KMSibley, LD Inhibition of Calcium Dependent Protein Kinase 1 (CDPK1) by Pyrazolopyrimidine Analogs Decreases Establishment and Reoccurrence of Central Nervous System Disease by Toxoplasma gondii. J Med Chem60:9976-9989 (2017) 
 
Proto-oncogene tyrosine-protein kinase Src
Name:Proto-oncogene tyrosine-protein kinase Src
Type:Protein
Mol. Mass.:59838.60
Organism:Homo sapiens (Human)
Description:P12931
Residue:536
BDBM50250017
NameBDBM50250017
Synonyms:CHEMBL4102392 | US11208411, Compound GXJ177
TypeSmall organic molecule
Emp. Form.C15H16BrN5O
Mol. Mass.362.224
SMILESCC(C)(C)n1nc(Oc2cccc(Br)c2)c2c(N)ncnc12