Reaction Details
TargetProto-oncogene tyrosine-protein kinase Src
LigandBDBM50250102
Substrate/Competitorn/a
Meas. Tech.ChEBML_1680860
IC50>10000±n/a nM
Citation Rutaganira, FUBarks, JDhason, MSWang, QLopez, MSLong, SRadke, JBJones, NGMaddirala, ARJanetka, JWEl Bakkouri, MHui, RShokat, KMSibley, LD Inhibition of Calcium Dependent Protein Kinase 1 (CDPK1) by Pyrazolopyrimidine Analogs Decreases Establishment and Reoccurrence of Central Nervous System Disease by Toxoplasma gondii. J Med Chem60:9976-9989 (2017) 
 
Proto-oncogene tyrosine-protein kinase Src
Name:Proto-oncogene tyrosine-protein kinase Src
Type:Protein
Mol. Mass.:59838.60
Organism:Homo sapiens (Human)
Description:P12931
Residue:536
BDBM50250102
NameBDBM50250102
Synonyms:CHEMBL4067196 | US11208411, Compound FUR6-12
TypeSmall organic molecule
Emp. Form.C15H15ClN6O
Mol. Mass.330.772
SMILESNc1ncnc2n(CC3CNC3)nc(Oc3cccc(Cl)c3)c12