Reaction Details
TargetGlucocorticoid receptor
LigandBDBM141368
Substrate/Competitorn/a
Meas. Tech.ChEBML_1680911
IC50 0.340000±n/a nM
Citation Hemmerling, MNilsson, SEdman, KEirefelt, SRussell, WHendrickx, RJohnsson, EKärrman Mårdh, CBerger, MRehwinkel, HAbrahamsson, ADahmén, JEriksson, ARGabos, BHenriksson, KHossain, NIvanova, SJansson, AHJensen, TJJerre, AJohansson, HKlingstedt, TLepistö, MLindsjö, MMile, INikitidis, GSteele, JTehler, UWissler, LHansson, T Selective Nonsteroidal Glucocorticoid Receptor Modulators for the Inhaled Treatment of Pulmonary Diseases. J Med Chem60:8591-8605 (2017) 
 
Glucocorticoid receptor
Name:Glucocorticoid receptor
Type:Enzyme Catalytic Domain
Mol. Mass.:87556.83
Organism:RAT
Description:Glucocorticoid 0 RAT::P06536
Residue:795
BDBM141368
NameBDBM141368
Synonyms:US8916600, 2 US9738632, Example 2
TypeSmall organic molecule
Emp. Form.C32H32F2N4O7S
Mol. Mass.654.681
SMILESC[C@H](NC(=O)C(C)(F)F)[C@H](Oc1ccc2n(ncc2c1)-c1cccc(c1)C(=O)N[C@@H]1CCS(=O)(=O)C1)c1ccc2OCCOc2c1