Reaction Details
TargetGlucocorticoid receptor
LigandBDBM50203419
Substrate/Competitorn/a
Meas. Tech.ChEMBL_1680909 (CHEMBL4031186)
IC50 0.500000±n/a nM
Citation Hemmerling, MNilsson, SEdman, KEirefelt, SRussell, WHendrickx, RJohnsson, EKärrman Mårdh, CBerger, MRehwinkel, HAbrahamsson, ADahmén, JEriksson, ARGabos, BHenriksson, KHossain, NIvanova, SJansson, AHJensen, TJJerre, AJohansson, HKlingstedt, TLepistö, MLindsjö, MMile, INikitidis, GSteele, JTehler, UWissler, LHansson, T Selective Nonsteroidal Glucocorticoid Receptor Modulators for the Inhaled Treatment of Pulmonary Diseases. J Med Chem60:8591-8605 (2017) 
 
Glucocorticoid receptor
Name:Glucocorticoid receptor
Type:Enzyme
Mol. Mass.:85656.87
Organism:Homo sapiens (Human)
Description:P04150
Residue:777
BDBM50203419
NameBDBM50203419
Synonyms:CHEMBL3915997
TypeSmall organic molecule
Emp. Form.C24H19F4N3O2
Mol. Mass.457.4202
SMILESC[C@H](NC(=O)C(F)(F)F)[C@H](Oc1ccc2n(ncc2c1)-c1ccc(F)cc1)c1ccccc1