Reaction Details
TargetGlucocorticoid receptor
LigandBDBM50250112
Substrate/Competitorn/a
Meas. Tech.ChEBML_1680911
IC50 0.140000±n/a nM
Citation Hemmerling, MNilsson, SEdman, KEirefelt, SRussell, WHendrickx, RJohnsson, EKärrman Mårdh, CBerger, MRehwinkel, HAbrahamsson, ADahmén, JEriksson, ARGabos, BHenriksson, KHossain, NIvanova, SJansson, AHJensen, TJJerre, AJohansson, HKlingstedt, TLepistö, MLindsjö, MMile, INikitidis, GSteele, JTehler, UWissler, LHansson, T Selective Nonsteroidal Glucocorticoid Receptor Modulators for the Inhaled Treatment of Pulmonary Diseases. J Med Chem60:8591-8605 (2017) 
 
Glucocorticoid receptor
Name:Glucocorticoid receptor
Type:Enzyme Catalytic Domain
Mol. Mass.:87556.83
Organism:RAT
Description:Glucocorticoid 0 RAT::P06536
Residue:795
BDBM50250112
NameBDBM50250112
Synonyms:CHEMBL4072756
TypeSmall organic molecule
Emp. Form.C25H21F4N3O3
Mol. Mass.487.4462
SMILESCOc1cccc(c1)[C@@H](Oc1ccc2n(ncc2c1)-c1ccc(F)cc1)[C@H](C)NC(=O)C(F)(F)F