Reaction Details
TargetGlucocorticoid receptor
LigandBDBM141379
Substrate/Competitorn/a
Meas. Tech.ChEMBL_1680907 (CHEMBL4031184)
IC50 0.062000±n/a nM
Citation Hemmerling, MNilsson, SEdman, KEirefelt, SRussell, WHendrickx, RJohnsson, EKärrman Mårdh, CBerger, MRehwinkel, HAbrahamsson, ADahmén, JEriksson, ARGabos, BHenriksson, KHossain, NIvanova, SJansson, AHJensen, TJJerre, AJohansson, HKlingstedt, TLepistö, MLindsjö, MMile, INikitidis, GSteele, JTehler, UWissler, LHansson, T Selective Nonsteroidal Glucocorticoid Receptor Modulators for the Inhaled Treatment of Pulmonary Diseases. J Med Chem60:8591-8605 (2017) 
 
Glucocorticoid receptor
Name:Glucocorticoid receptor
Type:Enzyme
Mol. Mass.:85656.87
Organism:Homo sapiens (Human)
Description:P04150
Residue:777
BDBM141379
NameBDBM141379
Synonyms:US8916600, 13 | US9738632, Example 13
TypeSmall organic molecule
Emp. Form.C34H31F2N5O5
Mol. Mass.627.6372
SMILESC[C@H](NC(=O)C(C)(F)F)[C@H](Oc1ccc2n(ncc2c1)-c1cccc(c1)C(=O)NCc1cccnc1)c1ccc2COCOc2c1