Reaction Details
TargetMuscarinic acetylcholine receptor M1
LigandBDBM50005686
Substrate/Competitorn/a
Meas. Tech.ChEBML_138403
Ki 4±n/a nM
Citation Leader, HGordon, RKBaumgold, JBoyd, VLNewman, AHSmejkal, RMChiang, PK Muscarinic receptor subtype specificity of (N,N-dialkylamino)alkyl 2-cyclohexyl-2-phenylpropionates: cylexphenes (cyclohexyl-substituted aprophen analogues). J Med Chem35:1290-5 (1992) Muscarinic acetylcholine receptor M1
Name:Muscarinic acetylcholine receptor M1
Type:Protein
Mol. Mass.:51442.54
Organism:Homo sapiens (Human)
Description:P11229
Residue:460
BDBM50005686
NameBDBM50005686
Synonyms:2-Cyclohexyl-2-phenyl-propionic acid 2-diethylamino-ethyl ester | CHEMBL443780
TypeSmall organic molecule
Emp. Form.C21H33NO2
Mol. Mass.331.4922
SMILESCCN(CC)CCOC(=O)C(C)(C1CCCCC1)c1ccccc1