Reaction Details
TargetLeucine-rich repeat serine/threonine-protein kinase 2
LigandBDBM254930
Substrate/Competitorn/a
Meas. Tech.ChEMBL_1681549 (CHEMBL4031826)
IC50 100±n/a nM
Citation Williamson, DSSmith, GPAcheson-Dossang, PBedford, STChell, VChen, IJDaechsel, JCADaniels, ZDavid, LDokurno, PHentzer, MHerzig, MCHubbard, REMoore, JDMurray, JBNewland, SRay, SCShaw, TSurgenor, AETerry, LThirstrup, KWang, YChristensen, KV Design of Leucine-Rich Repeat Kinase 2 (LRRK2) Inhibitors Using a Crystallographic Surrogate Derived from Checkpoint Kinase 1 (CHK1). J Med Chem60:8945-8962 (2017) 
 
Leucine-rich repeat serine/threonine-protein kinase 2
Name:Leucine-rich repeat serine/threonine-protein kinase 2
Type:Protein
Mol. Mass.:286113.20
Organism:Homo sapiens (Human)
Description:Q5S007
Residue:2527
BDBM254930
NameBDBM254930
Synonyms:US9499542, 13 | US9675594, 13
TypeSmall organic molecule
Emp. Form.C18H14N6
Mol. Mass.314.344
SMILESCn1ccc(Nc2cc(-c3ccccc3)c3c(c[nH]c3n2)C#N)n1