Reaction Details
TargetLeucine-rich repeat serine/threonine-protein kinase 2
LigandBDBM254929
Substrate/Competitorn/a
Meas. Tech.ChEMBL_1681551 (CHEMBL4031828)
IC50 62±n/a nM
Citation Williamson, DSSmith, GPAcheson-Dossang, PBedford, STChell, VChen, IJDaechsel, JCADaniels, ZDavid, LDokurno, PHentzer, MHerzig, MCHubbard, REMoore, JDMurray, JBNewland, SRay, SCShaw, TSurgenor, AETerry, LThirstrup, KWang, YChristensen, KV Design of Leucine-Rich Repeat Kinase 2 (LRRK2) Inhibitors Using a Crystallographic Surrogate Derived from Checkpoint Kinase 1 (CHK1). J Med Chem60:8945-8962 (2017) 
 
Leucine-rich repeat serine/threonine-protein kinase 2
Name:Leucine-rich repeat serine/threonine-protein kinase 2
Type:Protein
Mol. Mass.:286113.20
Organism:Homo sapiens (Human)
Description:Q5S007
Residue:2527
BDBM254929
NameBDBM254929
Synonyms:US9499542, 12 | US9675594, 12
TypeSmall organic molecule
Emp. Form.C15H12N4
Mol. Mass.248.2826
SMILESCc1cccc(c1)-c1cc(N)nc2[nH]cc(C#N)c12