Reaction Details
TargetMu-type opioid receptor
LigandBDBM50326662
Substrate/Competitorn/a
Meas. Tech.ChEMBL_1681722 (CHEMBL4031999)
Ki 0.320000±n/a nM
Citation Dumitrascuta, MBen Haddou, TGuerrieri, ENoha, SMSchläfer, LSchmidhammer, HSpetea, M Synthesis, Pharmacology, and Molecular Docking Studies on 6-Desoxo-N-methylmorphinans as Potent?-Opioid Receptor Agonists. J Med Chem60:9407-9412 (2017) 
 
Mu-type opioid receptor
Name:Mu-type opioid receptor
Type:G Protein-Coupled Receptor (GPCR)
Mol. Mass.:44789.51
Organism:Homo sapiens (Human)
Description:P35372
Residue:400
BDBM50326662
NameBDBM50326662
Synonyms:10-hydroxy-17-methoxy-4-methyl-(13R,17S)-12-oxa-4-azapentacyclo[9.6.1.01,13.05,17.07,18]octadeca-7(18),8,10-trien-14-one | CHEMBL607405
TypeSmall organic molecule
Emp. Form.C18H21NO4
Mol. Mass.315.3636
SMILESCO[C@]12CCC(=O)[C@@H]3Oc4c5c(C[C@H]1N(C)CC[C@@]235)ccc4O