Reaction Details
TargetDelta-type opioid receptor
LigandBDBM50250450
Substrate/Competitorn/a
Meas. Tech.ChEBML_1681723
Ki 0.890000±n/a nM
Citation Dumitrascuta, MBen Haddou, TGuerrieri, ENoha, SMSchläfer, LSchmidhammer, HSpetea, M Synthesis, Pharmacology, and Molecular Docking Studies on 6-Desoxo-N-methylmorphinans as Potent?-Opioid Receptor Agonists. J Med Chem60:9407-9412 (2017) 
 
Delta-type opioid receptor
Name:Delta-type opioid receptor
Type:G Protein-Coupled Receptor (GPCR)
Mol. Mass.:40382.98
Organism:Homo sapiens (Human)
Description:Competition binding assays were carried out using membrane preparations from transfected HN9.10 cells that constitutively expressed the delta opioid receptor.
Residue:372
BDBM50250450
NameBDBM50250450
Synonyms:CHEMBL4103328
TypeSmall organic molecule
Emp. Form.C24H27NO3
Mol. Mass.377.4761
SMILES[H][C@@]12CCC[C@@]3(OCc4ccccc4)[C@@]4([H])Cc5ccc(O)c(O1)c5[C@@]23CCN4C