Reaction Details
TargetRenin
LigandBDBM50006198
Substrate/Competitorn/a
Meas. Tech.ChEMBL_195918 (CHEMBL803387)
pH7.4±n/a
IC50 7.3±n/a nM
Commentsextracted
Citation Boyd, SAFung, AKBaker, WRMantei, RAArmiger, YLStein, HHCohen, JEgan, DABarlow, JLKlinghofer, V C-terminal modifications of nonpeptide renin inhibitors: improved oral bioavailability via modification of physicochemical properties. J Med Chem35:1735-46 (1992) Renin
Name:Renin
Type:Enzyme
Mol. Mass.:45058.99
Organism:Homo sapiens (Human)
Description:n/a
Residue:406
BDBM50006198
NameBDBM50006198
Synonyms:(2S,4S,5S)-5-{(S)-2-[(S)-1-Benzyl-2-(4-methoxymethoxy-piperidin-1-yl)-2-oxo-ethylamino]-hexanoylamino}-6-cyclohexyl-4-hydroxy-2-isopropyl-hexanoic acid (3-morpholin-4-yl-propyl)-amide CHEMBL52060
TypeSmall organic molecule
Emp. Form.C44H75N5O7
Mol. Mass.786.0956
SMILESCCCC[C@H](N[C@@H](Cc1ccccc1)C(=O)N1CCC(CC1)OCOC)C(=O)N[C@@H](CC1CCCCC1)[C@@H](O)C[C@@H](C(C)C)C(=O)NCCCN1CCOCC1