Reaction Details
TargetAldo-keto reductase family 1 member B1
LigandBDBM50006475
Substrate/Competitorn/a
Meas. Tech.ChEBML_31769
IC50 3.3±n/a nM
Citation Mylari, BLZembrowski, WJBeyer, TAAldinger, CESiegel, TW Orally active aldose reductase inhibitors: indazoleacetic, oxopyridazineacetic, and oxopyridopyridazineacetic acid derivatives. J Med Chem35:2155-62 (1992) Aldo-keto reductase family 1 member B1
Name:Aldo-keto reductase family 1 member B1
Type:Protein
Mol. Mass.:35855.50
Organism:Homo sapiens (Human)
Description:P15121. 4LAU; 2IKI; 4LB4; 2FZD; 2FZ8; 1US0
Residue:316
BDBM50006475
NameBDBM50006475
Synonyms:CHEMBL71966 | {1-[3-(2,3-Difluoro-phenyl)-[1,2,4]oxadiazol-5-ylmethyl]-4,5-dimethyl-6-oxo-1,6-dihydro-pyridazin-3-yl}-acetic acid
TypeSmall organic molecule
Emp. Form.C17H14F2N4O4
Mol. Mass.376.3143
SMILESCc1c(C)c(=O)n(Cc2nc(no2)-c2cccc(F)c2F)nc1CC(O)=O