Reaction Details
TargetMuscarinic acetylcholine receptor M1
LigandBDBM46858
Substrate/Competitorn/a
Meas. Tech.ChEBML_138793
IC50 77±n/a nM
Citation Sauerberg, POlesen, PHNielsen, STreppendahl, SSheardown, MJHonoré, TMitch, CHWard, JSPike, AJBymaster, FP Novel functional M1 selective muscarinic agonists. Synthesis and structure-activity relationships of 3-(1,2,5-thiadiazolyl)-1,2,5,6-tetrahydro-1-methylpyridines . J Med Chem35:2274-83 (1992) Muscarinic acetylcholine receptor M1
Name:Muscarinic acetylcholine receptor M1
Type:Enzyme Catalytic Domain
Mol. Mass.:51390.46
Organism:RAT
Description:P08482
Residue:460
BDBM46858
NameBDBM46858
Synonyms:1-methyl-3,6-dihydro-2H-pyridine-5-carboxylic acid methyl ester;hydrobromide ARECOLINE HYDROBROMIDE SMR000058258 cid_9301 | methyl 1-methyl-3,6-dihydro-2H-pyridine-5-carboxylate;hydrobromide
TypeSmall organic molecule
Emp. Form.C8H13NO2
Mol. Mass.155.1943
SMILESCOC(=O)C1=CCCN(C)C1