Reaction Details
TargetM-phase inducer phosphatase 1
LigandBDBM50251716
Substrate/Competitorn/a
Meas. Tech.ChEBML_1684262
IC50 3230±n/a nM
Citation Zwergel, CCzepukojc, BEvain-Bana, EXu, ZStazi, GMori, MPatsilinakos, AMai, ABotta, BRagno, RBagrel, DKirsch, GMeiser, PJacob, CMontenarh, MValente, S Novel coumarin- and quinolinone-based polycycles as cell division cycle 25-A and -C phosphatases inhibitors induce proliferation arrest and apoptosis in cancer cells. Eur J Med Chem134:316-333 (2017) 
 
M-phase inducer phosphatase 1
Name:M-phase inducer phosphatase 1
Type:Protein
Mol. Mass.:59090.18
Organism:Homo sapiens (Human)
Description:P30304
Residue:524
BDBM50251716
NameBDBM50251716
Synonyms:CHEMBL4097300
TypeSmall organic molecule
Emp. Form.C21H11NO3
Mol. Mass.325.3169
SMILESO=C1C=CC(=O)c2c1ccc1c3ccc4ccccc4c3[nH]c(=O)c21