Reaction Details
TargetM-phase inducer phosphatase 3
LigandBDBM50251698
Substrate/Competitorn/a
Meas. Tech.ChEBML_1684263
IC50 3640±n/a nM
Citation Zwergel, CCzepukojc, BEvain-Bana, EXu, ZStazi, GMori, MPatsilinakos, AMai, ABotta, BRagno, RBagrel, DKirsch, GMeiser, PJacob, CMontenarh, MValente, S Novel coumarin- and quinolinone-based polycycles as cell division cycle 25-A and -C phosphatases inhibitors induce proliferation arrest and apoptosis in cancer cells. Eur J Med Chem134:316-333 (2017) 
 
M-phase inducer phosphatase 3
Name:M-phase inducer phosphatase 3
Type:Substrate
Mol. Mass.:53366.11
Organism:Homo sapiens (Human)
Description:P30307
Residue:473
BDBM50251698
NameBDBM50251698
Synonyms:CHEMBL4105005
TypeSmall organic molecule
Emp. Form.C17H9NO3
Mol. Mass.275.2583
SMILESO=C1C=CC(=O)c2c1ccc1c3ccccc3[nH]c(=O)c21